has broader
sub property of: broaderTransitive
definition: Relates a concept to a concept that is more general in meaning.
comment: Broader concepts are typically rendered as parents in a concept hierarchy (tree).

UNESCO Thesaurus
type: ConceptScheme
preferred label: Тезаурус ЮНЕСКО @ru
preferred label: Thésaurus de l'UNESCO @fr
preferred label: Tesauro de la UNESCO @es

East Asia
type: Concept
preferred label: Восточная Азия @ru
preferred label: Asia Oriental @es
preferred label: Asie orientale @fr
narrower: Макао КНР

Concept
type: Class

preferred label
sub property of: label
definition: The preferred lexical label for a resource, in a given language.
comment: skos:prefLabel, skos:altLabel and skos:hiddenLabel are pairwise disjoint properties.
comment: The range of skos:prefLabel is the class of RDF plain literals.
comment: A resource has no more than one value of skos:prefLabel per language tag.

Макао КНР
type: Concept
scope note: Используется по отношению к событиям, происходившим после 31 декабря 1999 г. В иных случаях используйте термин "Макао". @ru
scope note: Se aplica a los eventos posteriores al 20 de diciembre de 1999. En caso contrario, utilizar "Macao". @es
scope note: Use for events after 20 Dec. 1999. Otherwise, use Macao.
scope note: S'applique aux événements survenus après le 20 décembre 1999. Autrement, utiliser Macao. @fr
broader: Non-self governing territories
broader: East Asia
broader: Portuguese speaking countries
member of: Asia and the Pacific
preferred label: Macao, Chine @fr
preferred label: Macao, China
is in scheme: UNESCO Thesaurus

Non-self governing territories
type: Concept
preferred label: Несамоуправляемые территории @ru
preferred label: Territorio no autónomo @es
preferred label: Territoire non autonome @fr
narrower: Макао КНР

Portuguese speaking countries
type: Concept
preferred label: Португалоговорящие страны @ru
preferred label: País de habla portuguesa @es
preferred label: Pays lusophone @fr
narrower: Макао КНР

Asia and the Pacific
type: ConceptGroup
preferred label: Asia y Pacífico @es
preferred label: Asie et Pacifique @fr
preferred label: Азия и регион Тихого океана @ru
notation: 7.15
member: Макао КНР

is in scheme
definition: Relates a resource (for example a concept) to a concept scheme in which it is included.

scope note
sub property of: note
definition: A note that helps to clarify the meaning and/or the use of a concept.